{"text_format":"1","workbook":"xlsx","n_sheets":7,"sheets":["MENU","RC-1A","FO-DRE-09","Hoja1","GlobalMapper","Hoja2","Hoja3"],"not_rendered":{"charts":0,"images":2,"macros":1,"external_links":1,"defined_names":8,"comments":0,"pivot_tables":0},"unopened":[],"bounds":{"document_bytes":16777216,"sheet_cells":100000,"rows_first":2000,"rows_last":500,"rows_between":2000,"halvings":0,"cell_chars":16384,"cell_head_chars":4096},"cells_cut":0,"cells_raw":0,"read":"whole","date_system":"1900"}

{"sheet":"MENU","index":0,"n_rows":10,"n_cols":6,"rows_kept":10,"cut":false,"hidden":false,"merged":[[4,1,4,3],[1,1,1,3],[5,1,5,3]]}
[]
[null,"AGENCIA DE REGULACIÓN Y CONTROL DE LAS TELECOMUNICACIONES - ARCOTEL"]
[]
[]
[null,"FORMATOS TÉCNICOS OTH DE FRECUENCIAS DEL ESPECTRO RADIOELÉCTRICO"]
[null,"PARA EL SERVICIO RADIOAFICIONADOS"]
[]
[null,1,null,"SOLICITUD PARA LA OBTENCIÓN DEL TÍTULO HABILITANTE PARA SERVICIO RADIOADICIONADO",null,"FO-RC-1A"]
[]
[null,1,null,"INFORMACIÓN PARA EL SERVICIO RADIOAFICIONADO O BANDA CIUDADANA",null,"FO-DRE-09"]

{"sheet":"RC-1A","index":1,"n_rows":57,"n_cols":4,"rows_kept":57,"cut":false,"hidden":true,"merged":[[35,2,35,5],[36,2,36,5],[38,2,38,5],[1,1,3,3],[5,1,5,5],[13,1,13,5],[18,1,18,5],[19,1,19,5],[28,2,28,5],[26,2,26,5],[27,2,27,5],[29,2,29,5],[31,2,31,5],[21,1,21,5],[22,1,22,5],[30,2,30,5],[49,2,49,5],[52,1,52,5],[37,2,37,5],[42,2,42,5],[43,2,43,5],[44,2,44,5],[45,2,45,5],[47,2,47,5],[48,2,48,5],[46,2,46,5]]}
[]
[null,"SOLICITUD PARA LA OBTENCIÓN DEL TÍTULO HABILITANTE PARA LA OPERACIÓN DE RADIOAFICIONADO"]
[]
[]
[]
[]
[]
[null,null,null,"Fecha:"]
[]
[null,"Señor(a)\nDIRECTOR(A) EJECUTIVO(A)\nARCOTEL\nPresente.-"]
[]
[null,"De mi consideración:",null,"SI"]
[null,null,null,"NO"]
[null,"Por medio del presente, me permito solicitarle el otorgamiento del título habilitante para el servicio de Radioaficionado, en tal virtud, adjunto sírvase encontrar el Proyecto Técnico y demás requisitos legales establecidos en el Reglamento para Otorgar Títulos Habilitantes para Servicios del Régimen General de Telecomunicaciones y Frecuencias del Espectro Radioeléctrico, Reglamento para la Prestación de Servicios de Telecomunicaciones y Servicios de Radiodifusión por Suscripción."]
[]
[]
[null,"1. DATOS GENERALES DEL PETICIONARIO(A)"]
[null,null,null,"EMPRESA PÚBLICA O INSTUCIÓN DEL SECTOR PÚBLICO"]
[null,"TIPO DE SOLICITANTE:"]
[]
[]
[null,"OBJETO DE LA SOLICITUD:"]
[null,"REGISTRO"]
[]
[null,"1.1. DATOS GENERALES PERSONA NATURAL O REPRESENTANTE  LEGAL"]
[]
[null,"NOMBRES "]
[null,"APELLIDOS "]
[null,"CEDULA DE CIUDADANÍA /PASAPORTE"]
[null,"R.U.C."]
[null,"Nro. CERTIFICADO DE VOTACIÓN"]
[null,"CARGO"]
[]
[null,"1.2. DATOS GENERALES PERSONA JURÍDICA"]
[]
[null,"RAZÓN SOCIAL O DENOMINACIÓN OBJETIVA"]
[null,"ACTIVIDAD DE LA EMPRESA"]
[null,"R.U.C."]
[null,"Nro. DE DECRETO DE CREACIÓN DE LA ENTIDAD"]
[]
{"$rows_left_out":18}
{"sheet":"FO-DRE-09","index":2,"n_rows":102,"n_cols":27,"rows_kept":102,"cut":false,"hidden":false,"merged":[[0,24,0,26],[2,18,3,22],[2,23,3,26],[2,2,3,6],[2,7,3,15],[1,2,1,6],[1,7,1,15],[1,18,1,22],[1,23,1,26],[1,16,1,17],[0,0,0,1],[0,2,0,23],[2,0,4,0],[2,1,4,1],[1,0,1,1],[2,16,3,17]]}
["Código: FO-DRE-09\nVersión: 01 ",null,"FORMULARIO PARA EL  REGISTRO DE RADIOAFICIONADOS O BANDA CIUDADANA"]
[1,null,2,null,null,null,null,3,null,null,null,null,null,null,null,null,4,null,5,null,null,null,null,6]
["OBJETO DE LA SOLICITUD","CATEGORIA","DATOS DEL SOLICITANTE",null,null,null,null,"DIRECCION DOMICILIARIA",null,null,null,null,null,null,null,null,"INDICATIVO",null,"CARACTERISTICA DE LA ESTACION FIJA",null,null,null,null,"CARACTERISTICA DE LOS EQUIPOS"]
[]
[null,null,"APELLIDO PATERNO","APELLIDO MATERNO","NOMBRES","NACIONALIDAD","C.C./PASAPORTE","PROVINCIA","CANTON","CIUDAD/ PARROQUIA","DIRECCION","CASILLA","TELEFONO FIJO","CELULAR","e-mail","CODIGO POSTAL","RADIOCLUB","DISTINTIVO DE LLAMADA","DISTRITO","PROVINCIAS QUE PERTENECEN A ESE DISTRITO","PROVINCIA","CANTON","CIUDAD/\nPARROQUIA","CODIGO DEL EQUIPO","MARCA","MODELO","POTENCIA DE SALIDA"]
[null,null,null,null,null,null,null,null,null,null,null,null,null,null,null,null,null,null,"D4",{"$f":"LOOKUP(S6,Hoja1!F7:G15)","v":"EL ORO-LOJA"}]
[null,null,null,null,null,null,null,null,null,null,null,null,null,null,null,null,null,null,"D7",{"$f":"LOOKUP(S7,Hoja1!F8:G15)","v":"COTOPAXI-TUNGURAHUA-BOLIVAR"}]
[null,null,null,null,null,null,null,null,null,null,null,null,null,null,null,null,null,null,null,{"$f":"LOOKUP(S8,Hoja1!F9:G15)","v":{"$error":"#N/A"}}]
[null,null,null,null,null,null,null,null,null,null,null,null,null,null,null,null,null,null,null,{"$f":"LOOKUP(S9,Hoja1!F10:G15)","v":{"$error":"#N/A"}}]
[null,null,null,null,null,null,null,null,null,null,null,null,null,null,null,null,null,null,null,{"$f":"LOOKUP(S10,Hoja1!F11:G15)","v":{"$error":"#N/A"}}]
[null,null,null,null,null,null,null,null,null,null,null,null,null,null,null,null,null,null,null,{"$f":"LOOKUP(S11,Hoja1!F12:G16)","v":{"$error":"#N/A"}}]
[null,null,null,null,null,null,null,null,null,null,null,null,null,null,null,null,null,null,null,{"$f":"LOOKUP(S12,Hoja1!F13:G16)","v":{"$error":"#N/A"}}]
[null,null,null,null,null,null,null,null,null,null,null,null,null,null,null,null,null,null,null,{"$f":"LOOKUP(S13,Hoja1!F14:G16)","v":{"$error":"#N/A"}}]
[null,null,null,null,null,null,null,null,null,null,null,null,null,null,null,null,null,null,null,{"$f":"LOOKUP(S14,Hoja1!F15:G16)","v":{"$error":"#N/A"}}]
[null,null,null,null,null,null,null,null,null,null,null,null,null,null,null,null,null,null,null,{"$f":"LOOKUP(S15,Hoja1!F16:G16)","v":{"$error":"#N/A"}}]
[null,null,null,null,null,null,null,null,null,null,null,null,null,null,null,null,null,null,null,{"$f":"LOOKUP(S16,Hoja1!F16:G16)","v":{"$error":"#N/A"}}]
[null,null,null,null,null,null,null,null,null,null,null,null,null,null,null,null,null,null,null,{"$f":"LOOKUP(S17,Hoja1!F16:G16)","v":{"$error":"#N/A"}}]
[null,null,null,null,null,null,null,null,null,null,null,null,null,null,null,null,null,null,null,{"$f":"LOOKUP(S18,Hoja1!F16:G16)","v":{"$error":"#N/A"}}]
[null,null,null,null,null,null,null,null,null,null,null,null,null,null,null,null,null,null,null,{"$f":"LOOKUP(S19,Hoja1!F16:G16)","v":{"$error":"#N/A"}}]
[null,null,null,null,null,null,null,null,null,null,null,null,null,null,null,null,null,null,null,{"$f":"LOOKUP(S20,Hoja1!F16:G16)","v":{"$error":"#N/A"}}]
[null,null,null,null,null,null,null,null,null,null,null,null,null,null,null,null,null,null,null,{"$f":"LOOKUP(S21,Hoja1!F16:G17)","v":{"$error":"#N/A"}}]
[null,null,null,null,null,null,null,null,null,null,null,null,null,null,null,null,null,null,null,{"$f":"LOOKUP(S22,Hoja1!F17:G17)","v":{"$error":"#N/A"}}]
[null,null,null,null,null,null,null,null,null,null,null,null,null,null,null,null,null,null,null,{"$f":"LOOKUP(S23,Hoja1!F17:G17)","v":{"$error":"#N/A"}}]
[null,null,null,null,null,null,null,null,null,null,null,null,null,null,null,null,null,null,null,{"$f":"LOOKUP(S24,Hoja1!F17:G17)","v":{"$error":"#N/A"}}]
[null,null,null,null,null,null,null,null,null,null,null,null,null,null,null,null,null,null,null,{"$f":"LOOKUP(S25,Hoja1!F17:G17)","v":{"$error":"#N/A"}}]
[null,null,null,null,null,null,null,null,null,null,null,null,null,null,null,null,null,null,null,{"$f":"LOOKUP(S26,Hoja1!F17:G17)","v":{"$error":"#N/A"}}]
[null,null,null,null,null,null,null,null,null,null,null,null,null,null,null,null,null,null,null,{"$f":"LOOKUP(S27,Hoja1!F17:G17)","v":{"$error":"#N/A"}}]
[null,null,null,null,null,null,null,null,null,null,null,null,null,null,null,null,null,null,null,{"$f":"LOOKUP(S28,Hoja1!F17:G17)","v":{"$error":"#N/A"}}]
[null,null,null,null,null,null,null,null,null,null,null,null,null,null,null,null,null,null,null,{"$f":"LOOKUP(S29,Hoja1!F17:G17)","v":{"$error":"#N/A"}}]
[null,null,null,null,null,null,null,null,null,null,null,null,null,null,null,null,null,null,null,{"$f":"LOOKUP(S30,Hoja1!F17:G17)","v":{"$error":"#N/A"}}]
[null,null,null,null,null,null,null,null,null,null,null,null,null,null,null,null,null,null,null,{"$f":"LOOKUP(S31,Hoja1!F17:G17)","v":{"$error":"#N/A"}}]
[null,null,null,null,null,null,null,null,null,null,null,null,null,null,null,null,null,null,null,{"$f":"LOOKUP(S32,Hoja1!#REF!)","v":{"$error":"#REF!"}}]
[null,null,null,null,null,null,null,null,null,null,null,null,null,null,null,null,null,null,null,{"$f":"LOOKUP(S33,Hoja1!#REF!)","v":{"$error":"#REF!"}}]
[null,null,null,null,null,null,null,null,null,null,null,null,null,null,null,null,null,null,null,{"$f":"LOOKUP(S34,Hoja1!#REF!)","v":{"$error":"#REF!"}}]
[null,null,null,null,null,null,null,null,null,null,null,null,null,null,null,null,null,null,null,{"$f":"LOOKUP(S35,Hoja1!F18:G18)","v":{"$error":"#N/A"}}]
[null,null,null,null,null,null,null,null,null,null,null,null,null,null,null,null,null,null,null,{"$f":"LOOKUP(S36,Hoja1!F18:G19)","v":{"$error":"#N/A"}}]
[null,null,null,null,null,null,null,null,null,null,null,null,null,null,null,null,null,null,null,{"$f":"LOOKUP(S37,Hoja1!F18:G20)","v":{"$error":"#N/A"}}]
[null,null,null,null,null,null,null,null,null,null,null,null,null,null,null,null,null,null,null,{"$f":"LOOKUP(S38,Hoja1!F18:G21)","v":{"$error":"#N/A"}}]
[null,null,null,null,null,null,null,null,null,null,null,null,null,null,null,null,null,null,null,{"$f":"LOOKUP(S39,Hoja1!F18:G22)","v":{"$error":"#N/A"}}]
[null,null,null,null,null,null,null,null,null,null,null,null,null,null,null,null,null,null,null,{"$f":"LOOKUP(S40,Hoja1!F18:G23)","v":{"$error":"#N/A"}}]
{"$rows_left_out":63}
{"sheet":"Hoja1","index":3,"n_rows":27,"n_cols":7,"rows_kept":27,"cut":false,"hidden":true,"merged":[]}
["LISTAS DESPLEGABLES"]
[null,null,null,null,null,null,"REGISTRO"]
["PROVINCIAS",null,null,null,null,null,"RENOVACIÓN"]
["AZUAY"]
["BOLÍVAR"]
["CAÑAR",null,null,null,null,"DISTRITOS","DESCRIPCION"]
["CARCHI",null,null,null,null,"D1","CARCHI-IMBABURA-PICHINCHA-SANTO DOMINGO DE LOS TSACHILAS"]
["CHIMBORAZO",null,null,null,null,"D2","RESTO DE PICHINCHA-SUCUMBIOS-NAPO-ORELLANA"]
["COTOPAXI",null,null,null,null,"D3","GUAYAS-LOS RIOS-SANTA-ELENA"]
["EL ORO",null,null,null,null,"D4","EL ORO-LOJA"]
["ESMERALDAS",null,null,null,null,"D5","MANABI-ESMERALDAS"]
["GALÁPAGOS",null,null,null,null,"D6","CHIMBORAZO-CAÑAR-AZUAY"]
["GUAYAS",null,null,null,null,"D7","COTOPAXI-TUNGURAHUA-BOLIVAR"]
["IMBABURA",null,null,null,null,"D8","GALAPAGOS"]
["LOJA",null,null,null,null,"D9","ESTACION MALDONADO ANTARTIDA"]
["LOS RÍOS"]
["MANABÍ"]
["MORONA SANTIAGO"]
["NAPO",null,null,null,null,"CATEGORIAS"]
["ORELLANA",null,null,null,null,null,"TECNICO "]
["PASTAZA",null,null,null,null,null,"GENERAL"]
["PICHINCHA",null,null,null,null,null,"TRANSITO"]
["SANTA ELENA",null,null,null,null,null,"INTERNACIONAL"]
["SANTO DOMINGO DE LOS TSÁCHILAS"]
["SUCUMBÍOS"]
["TUNGURAHUA",null,null,null,null,"PERSONA NATURAL "]
["ZAMORA CHINCHIPE",null,null,null,null,"PERSONA JURÍDICA DE DERECHO PRIVADO"]

{"sheet":"GlobalMapper","index":4,"n_rows":0,"n_cols":0,"rows_kept":0,"cut":false,"hidden":true,"merged":[]}

{"sheet":"Hoja2","index":5,"n_rows":0,"n_cols":0,"rows_kept":0,"cut":false,"hidden":true,"merged":[]}

{"sheet":"Hoja3","index":6,"n_rows":487,"n_cols":23,"rows_kept":487,"cut":false,"hidden":true,"merged":[]}
[]
[null,"MODO","SEMIDUPLEX",null,null,"MODO","SEMIDUPLEX",null,null,"MODO","SEMIDUPLEX",null,null,"MODO","SEMIDUPLEX",null,null,"MODO","SEMIDUPLEX",null,null,"MODO","SIMPLEX"]
[null,"UHF",null,null,null,"UHF",null,null,null,"UHF",null,null,null,"UHF",null,null,null,"UHF",null,null,null,"UHF"]
[null,"BANDA",440,null,null,"BANDA",450,null,null,"BANDA",457.5,null,null,"BANDA",488,null,null,"BANDA",500,null,null,"BANDA",482]
[null,"AB",12.5,null,null,"AB",12.5,null,null,"AB",12.5,null,null,"AB",12.5,null,null,"AB",12.5,null,null,"AB",12.5]
[null,"SEPARACIÓN",5,null,null,"SEPARACIÓN",10,null,null,"SEPARACIÓN",10,null,null,"SEPARACIÓN",6,null,null,"SEPARACIÓN",6,null,null,"SEPARACIÓN",0]
[null,"TX","RX",null,null,"TX","RX",null,null,"TX","RX",null,null,"TX","RX",null,null,"TX","RX",null,null,"TX","RX"]
[1,440,445,null,1,450,460,null,1,457.5,460,null,1,488,494,null,1,500,506,null,1,482]
[2,440.01249999999999,445.01249999999999,null,2,450.01249999999999,460.01249999999999,null,2,457.51249999999999,467.51249999999999,null,2,488.01249999999999,494.01249999999999,null,2,500.01249999999999,506.01249999999999,null,2,482.01249999999999]
[3,440.02499999999998,445.02499999999998,null,3,450.02499999999998,460.02499999999998,null,3,457.52499999999998,467.52499999999998,null,3,488.02499999999998,494.02499999999998,null,3,500.02499999999998,506.02499999999998,null,3,482.02499999999998]
[4,440.03750000000002,445.03750000000002,null,4,450.03750000000002,460.03750000000002,null,4,457.53750000000002,472.53750000000002,null,4,488.03750000000002,494.03750000000002,null,4,500.03750000000002,506.03750000000002,null,4,482.03750000000002]
[5,440.05,445.05,null,5,450.05,460.05,null,5,457.55,476.3,null,5,488.05,494.05,null,5,500.05,506.05,null,5,482.05]
[6,440.0625,445.0625,null,6,450.0625,460.0625,null,6,457.5625,480.0625,null,6,488.0625,494.0625,null,6,500.0625,506.0625,null,6,482.0625]
[7,440.07499999999999,445.07499999999999,null,7,450.07499999999999,460.07499999999999,null,7,457.57499999999999,483.82499999999999,null,7,488.07499999999999,494.07499999999999,null,7,500.07499999999999,506.07499999999999,null,7,482.07499999999999]
[8,440.08749999999998,445.08749999999998,null,8,450.08749999999998,460.08749999999998,null,8,457.58749999999998,487.58749999999998,null,8,488.08749999999998,494.08749999999998,null,8,500.08749999999998,506.08749999999998,null,8,482.08749999999998]
[9,440.1,445.1,null,9,450.1,460.1,null,9,457.6,491.35,null,9,488.1,494.1,null,9,500.1,506.1,null,9,482.1]
[10,440.11250000000001,445.11250000000001,null,10,450.11250000000001,460.11250000000001,null,10,457.61250000000001,495.11250000000001,null,10,488.11250000000001,494.11250000000001,null,10,500.11250000000001,506.11250000000001,null,10,482.11250000000001]
[11,440.125,445.125,null,11,450.125,460.125,null,11,457.625,498.875,null,11,488.125,494.125,null,11,500.125,506.125,null,11,482.125]
[12,440.13749999999999,445.13749999999999,null,12,450.13749999999999,460.13749999999999,null,12,457.63749999999999,502.63749999999999,null,12,488.13749999999999,494.13749999999999,null,12,500.13749999999999,506.13749999999999,null,12,482.13749999999999]
[13,440.15,445.15,null,13,450.15,460.15,null,13,457.65,506.4,null,13,488.15,494.15,null,13,500.15,506.15,null,13,482.15]
[14,440.16250000000002,445.16250000000002,null,14,450.16250000000002,460.16250000000002,null,14,457.66250000000002,510.16250000000002,null,14,488.16250000000002,494.16250000000002,null,14,500.16250000000002,506.16250000000002,null,14,482.16250000000002]
[15,440.17500000000001,445.17500000000001,null,15,450.17500000000001,460.17500000000001,null,15,457.67500000000001,513.92499999999995,null,15,488.17500000000001,494.17500000000001,null,15,500.17500000000001,506.17500000000001,null,15,482.17500000000001]
[16,440.1875,445.1875,null,16,450.1875,460.1875,null,16,457.6875,517.6875,null,16,488.1875,494.1875,null,16,500.1875,506.1875,null,16,482.1875]
[17,440.2,445.2,null,17,450.2,460.2,null,17,457.7,521.45000000000005,null,17,488.2,494.2,null,17,500.2,506.2,null,17,482.2]
[18,440.21249999999998,445.21249999999998,null,18,450.21249999999998,460.21249999999998,null,18,457.71249999999998,525.21249999999998,null,18,488.21249999999998,494.21249999999998,null,18,500.21249999999998,506.21249999999998,null,18,482.21249999999998]
[19,440.22500000000002,445.22500000000002,null,19,450.22500000000002,460.22500000000002,null,19,457.72500000000002,528.97500000000002,null,19,488.22500000000002,494.22500000000002,null,19,500.22500000000002,506.22500000000002,null,19,482.22500000000002]
[20,440.23750000000001,445.23750000000001,null,20,450.23750000000001,460.23750000000001,null,20,457.73750000000001,532.73749999999995,null,20,488.23750000000001,494.23750000000001,null,20,500.23750000000001,506.23750000000001,null,20,482.23750000000001]
[21,440.25,445.25,null,21,450.25,460.25,null,21,457.75,536.5,null,21,488.25,494.25,null,21,500.25,506.25,null,21,482.25]
[22,440.26249999999999,445.26249999999999,null,22,450.26249999999999,460.26249999999999,null,22,457.76249999999999,540.26250000000005,null,22,488.26249999999999,494.26249999999999,null,22,500.26249999999999,506.26249999999999,null,22,482.26249999999999]
[23,440.27499999999998,445.27499999999998,null,23,450.27499999999998,460.27499999999998,null,23,457.77499999999998,544.02499999999998,null,23,488.27499999999998,494.27499999999998,null,23,500.27499999999998,506.27499999999998,null,23,482.27499999999998]
[24,440.28750000000002,445.28750000000002,null,24,450.28750000000002,460.28750000000002,null,24,457.78750000000002,547.78750000000002,null,24,488.28750000000002,494.28750000000002,null,24,500.28750000000002,506.28750000000002,null,24,482.28750000000002]
[25,440.3,445.3,null,25,450.3,460.3,null,25,457.8,551.54999999999995,null,25,488.3,494.3,null,25,500.3,506.3,null,25,482.3]
[26,440.3125,445.3125,null,26,450.3125,460.3125,null,26,457.8125,555.3125,null,26,488.3125,494.3125,null,26,500.3125,506.3125,null,26,482.3125]
[27,440.32499999999999,445.32499999999999,null,27,450.32499999999999,460.32499999999999,null,27,457.82499999999999,559.07500000000005,null,27,488.32499999999999,494.32499999999999,null,27,500.32499999999999,506.32499999999999,null,27,482.32499999999999]
[28,440.33749999999998,445.33749999999998,null,28,450.33749999999998,460.33749999999998,null,28,457.83749999999998,562.83749999999998,null,28,488.33749999999998,494.33749999999998,null,28,500.33749999999998,506.33749999999998,null,28,482.33749999999998]
[29,440.35,445.35,null,29,450.35,460.35,null,29,457.85,566.6,null,29,488.35,494.35,null,29,500.35,506.35,null,29,482.35]
[30,440.36250000000001,445.36250000000001,null,30,450.36250000000001,460.36250000000001,null,30,457.86250000000001,570.36249999999995,null,30,488.36250000000001,494.36250000000001,null,30,500.36250000000001,506.36250000000001,null,30,482.36250000000001]
[31,440.375,445.375,null,31,450.375,460.375,null,31,457.875,574.125,null,31,488.375,494.375,null,31,500.375,506.375,null,31,482.375]
[32,440.38749999999999,445.38749999999999,null,32,450.38749999999999,460.38749999999999,null,32,457.88749999999999,577.88750000000005,null,32,488.38749999999999,494.38749999999999,null,32,500.38749999999999,506.38749999999999,null,32,482.38749999999999]
[33,440.4,445.4,null,33,450.4,460.4,null,33,457.9,581.65,null,33,488.4,494.4,null,33,500.4,506.4,null,33,482.4]
{"$rows_left_out":447}